{"text_format":"3","workbook":"xlsx","n_sheets":3,"sheets":["Points","HR","EN"],"not_rendered":{"defined_names":1},"read":"whole","date_system":"1900"}

{"sheet":"Points","index":0,"n_rows":847,"n_cols":12,"rows_kept":847,"hidden":true}
["vlookup_key","vlookup_key","jmbag","Prezime","Ime","Prezime i ime","Player","matching","outcome","Moodle","Kahoot","Kahoot>Schoolwork"]
[{"$f":"IF(C2<>\"\",C2&\"-\"& VALUE(I2),\"Ne postoji JMBAG\")","v":"0321028458-1"},{"$f":"IF(C2<>\"\",\"PostojiJMBAG\",F2&\"-\"& VALUE(I2))","v":"PostojiJMBAG"},"0321028458","Anastasov","Marino","Anastasov Marino","marino a","reversed username 4",1,1.9,1.75,"No"]
[{"$f":"IF(C3<>\"\",C3&\"-\"& VALUE(I3),\"Ne postoji JMBAG\")","v":"0321028458-3"},{"$f":"IF(C3<>\"\",\"PostojiJMBAG\",F3&\"-\"& VALUE(I3))","v":"PostojiJMBAG"},"0321028458","Anastasov","Marino","Anastasov Marino","marino a","reversed username 4",3,null,0.75,"No"]
["0321028458-4","PostojiJMBAG","0321028458","Anastasov","Marino","Anastasov Marino","marino a","reversed username 4",4,null,3,"No"]
["0321028458-5","PostojiJMBAG","0321028458","Anastasov","Marino","Anastasov Marino","marino a","reversed username 4",5,0.6,0,"No"]
["0321028458-7","PostojiJMBAG","0321028458","Anastasov","Marino","Anastasov Marino","marino a","reversed username 4",7,2.5,1,"No"]
["0321028458-9","PostojiJMBAG","0321028458","Anastasov","Marino","Anastasov Marino","marino a","reversed username 4",9,2.3,0,"No"]
["0195045059-1","PostojiJMBAG","0195045059","Andrašić","Luka","Andrašić Luka","luka a","reversed username 4",1,3,1.5,"No"]
["0195045059-2","PostojiJMBAG","0195045059","Andrašić","Luka","Andrašić Luka","luka a","reversed username 4",2,2.4,1,"No"]
["0195045059-3","PostojiJMBAG","0195045059","Andrašić","Luka","Andrašić Luka","luka a","reversed username 4",3,2.1,0.75,"No"]
["0195045059-5","PostojiJMBAG","0195045059","Andrašić","Luka","Andrašić Luka","luka a","reversed username 4",5,2.8,0,"No"]
["0195045059-6","PostojiJMBAG","0195045059","Andrašić","Luka","Andrašić Luka","luka a","reversed username 4",6,2,1,"No"]
["0195045059-7","PostojiJMBAG","0195045059","Andrašić","Luka","Andrašić Luka","luka a","reversed username 4",7,2.5,1,"No"]
["Ne postoji JMBAG","Andrić Mateo-1",null,"Andrić","Mateo","Andrić Mateo","mateo a","reversed username 4",1,1.5,1.75,"No"]
["Ne postoji JMBAG","Andrić Mateo-3",null,"Andrić","Mateo","Andrić Mateo","mateo a","reversed username 4",3,1.9,0.5,"No"]
["Ne postoji JMBAG","Andrić Mateo-4",null,"Andrić","Mateo","Andrić Mateo","mandric","direct",4,1.6,2,"No"]
["0321025830-1","PostojiJMBAG","0321025830","Andrić","Tina","Andrić Tina","tandric","direct",1,2.3,1.75,"No"]
["7606002883-1","PostojiJMBAG","7606002883","Antolović","Noa","Antolović Noa","noa antolovic","one first and last name",1,2.3,1.25,"No"]
["7606002883-3","PostojiJMBAG","7606002883","Antolović","Noa","Antolović Noa","noa antolovic","one first and last name",3,3,0.25,"No"]
["7606002883-4","PostojiJMBAG","7606002883","Antolović","Noa","Antolović Noa","noa antolovic","one first and last name",4,3,1.5,"No"]
["7606002883-5","PostojiJMBAG","7606002883","Antolović","Noa","Antolović Noa","noa antolovic","one first and last name",5,3,0.5,"No"]
["7606002883-6","PostojiJMBAG","7606002883","Antolović","Noa","Antolović Noa","noa antolovic","one first and last name",6,3,1.5,"No"]
["7606002883-7","PostojiJMBAG","7606002883","Antolović","Noa","Antolović Noa","noaa","reversed username 4",7,3,0.75,"No"]
["7606002883-9","PostojiJMBAG","7606002883","Antolović","Noa","Antolović Noa","noa a","reversed username 4",9,2.3,0,"No"]
["7606003368-1","PostojiJMBAG","7606003368","Antunović","Nina","Antunović Nina","nina a","reversed username 4",1,1.5,1.5,"No"]
["7606003368-7","PostojiJMBAG","7606003368","Antunović","Nina","Antunović Nina","nina a","reversed username 4",7,null,0,"No"]
["7606003854-1","PostojiJMBAG","7606003854","Arežina","Marko","Arežina Marko","marko a","reversed username 4",1,1.9,1,"Yes"]
["7606003854-3","PostojiJMBAG","7606003854","Arežina","Marko","Arežina Marko","ma","reversed username 2",3,1.89999999999999,0,"No"]
["7606003854-5","PostojiJMBAG","7606003854","Arežina","Marko","Arežina Marko","ma","reversed username 2",5,0.8,0.75,"No"]
["Ne postoji JMBAG","Baltić Alan-1",null,"Baltić","Alan","Baltić Alan","alan b","reversed username 4",1,2.3,1.5,"No"]
["Ne postoji JMBAG","Baltić Alan-3",null,"Baltić","Alan","Baltić Alan","alanb","reversed username 4",3,1.3,0.5,"No"]
["Ne postoji JMBAG","Baltić Alan-4",null,"Baltić","Alan","Baltić Alan","alanb","reversed username 4",4,2,1.5,"No"]
["Ne postoji JMBAG","Baltić Alan-5",null,"Baltić","Alan","Baltić Alan","alanb","reversed username 4",5,2.4,0,"No"]
["Ne postoji JMBAG","Baltić Alan-6",null,"Baltić","Alan","Baltić Alan","alanb","reversed username 4",6,2.4,0.5,"No"]
["Ne postoji JMBAG","Baltić Alan-7",null,"Baltić","Alan","Baltić Alan","alanb","reversed username 4",7,2.9,1.5,"Yes"]
["Ne postoji JMBAG","Baltić Alan-8",null,"Baltić","Alan","Baltić Alan","alanb","reversed username 4",8,2.3,1,"No"]
["Ne postoji JMBAG","Baltić Alan-9",null,"Baltić","Alan","Baltić Alan","alanb","reversed username 4",9,3,0,"No"]
["Ne postoji JMBAG","Banda Pino-1",null,"Banda","Pino","Banda Pino","pinobanda","reversed username 4",1,2.3,0.666666666666666,"No"]
["Ne postoji JMBAG","Banda Pino-3",null,"Banda","Pino","Banda Pino","pinob","reversed username 4",3,2.5,0.5,"No"]
["Ne postoji JMBAG","Banda Pino-4",null,"Banda","Pino","Banda Pino","pbanda","direct",4,3,2.5,"No"]
["Ne postoji JMBAG","Banda Pino-5",null,"Banda","Pino","Banda Pino","pinobanda","reversed username 4",5,1.8,1,"No"]
["Ne postoji JMBAG","Banda Pino-7",null,"Banda","Pino","Banda Pino","pinob","reversed username 4",7,3,0.75,"No"]
["Ne postoji JMBAG","Banda Pino-9",null,"Banda","Pino","Banda Pino","pinob","reversed username 4",9,3,2,"No"]
["7606002493-1","PostojiJMBAG","7606002493","Barun","Matej","Barun Matej","mbarun","reversed username",1,1.5,1.25,"No"]
["7606002493-3","PostojiJMBAG","7606002493","Barun","Matej","Barun Matej","mbarun","direct",3,3,0.25,"No"]
["7606002493-4","PostojiJMBAG","7606002493","Barun","Matej","Barun Matej","mbarun","direct",4,3,2.5,"No"]
["7606002493-5","PostojiJMBAG","7606002493","Barun","Matej","Barun Matej","mbarun","direct",5,2.5,0.5,"No"]
["7606002493-7","PostojiJMBAG","7606002493","Barun","Matej","Barun Matej","mbarun","direct",7,3,1.5,"No"]
["7606002493-9","PostojiJMBAG","7606002493","Barun","Matej","Barun Matej","mbarun","direct",9,2.3,0,"Yes"]
["7606002899-1","PostojiJMBAG","7606002899","Bebek","Bruno","Bebek Bruno","bbebek","direct",1,1.1,2.5,"No"]
["7606002899-3","PostojiJMBAG","7606002899","Bebek","Bruno","Bebek Bruno","bebek","only last name",3,1.8,0.75,"No"]
["7606002899-4","PostojiJMBAG","7606002899","Bebek","Bruno","Bebek Bruno","bbebek","direct",4,3,1.5,"No"]
["7606002899-5","PostojiJMBAG","7606002899","Bebek","Bruno","Bebek Bruno","bebek","only last name",5,1.5,0.5,"No"]
["7606002899-6","PostojiJMBAG","7606002899","Bebek","Bruno","Bebek Bruno","bebek","only last name",6,2.6,2.5,"No"]
["7606002899-7","PostojiJMBAG","7606002899","Bebek","Bruno","Bebek Bruno","bebek","only last name",7,2,0.75,"No"]
["7606002899-8","PostojiJMBAG","7606002899","Bebek","Bruno","Bebek Bruno","bebek","only last name",8,2.7,1,"No"]
["Ne postoji JMBAG","Bečeić Dean-1",null,"Bečeić","Dean","Bečeić Dean","deanbeceic","reversed username 4",1,2.3,0.333333333333333,"No"]
["Ne postoji JMBAG","Bečeić Dean-3",null,"Bečeić","Dean","Bečeić Dean","deanb","reversed username 4",3,1.4,0,"No"]
["Ne postoji JMBAG","Bečeić Dean-4",null,"Bečeić","Dean","Bečeić Dean","deanb","reversed username 4",4,1.8,2,"No"]
["Ne postoji JMBAG","Bečeić Dean-5",null,"Bečeić","Dean","Bečeić Dean","deanb","reversed username 4",5,null,0.5,"No"]
["Ne postoji JMBAG","Bilal Tony-1",null,"Bilal","Tony","Bilal Tony","tony bilal","reversed username",1,2.6,1.25,"No"]
["Ne postoji JMBAG","Bilal Tony-3",null,"Bilal","Tony","Bilal Tony","tbilal","reversed username",3,2.4,0,"No"]
["Ne postoji JMBAG","Bilal Tony-4",null,"Bilal","Tony","Bilal Tony","tbilal","reversed username",4,2.7,0,"No"]
["Ne postoji JMBAG","Bilal Tony-5",null,"Bilal","Tony","Bilal Tony","tbilal","reversed username",5,1.1,0,"No"]
["Ne postoji JMBAG","Biškup Karlo-1",null,"Biškup","Karlo","Biškup Karlo","karlo b","reversed username 4",1,2.6,1.17,"No"]
["Ne postoji JMBAG","Biškup Karlo-3",null,"Biškup","Karlo","Biškup Karlo","karlo b","reversed username 4",3,1.3,0.5,"No"]
[{"$f":"IF(C67<>\"\",C67&\"-\"& VALUE(I67),\"Ne postoji JMBAG\")","v":"Ne postoji JMBAG"},{"$f":"IF(C67<>\"\",\"PostojiJMBAG\",F67&\"-\"& VALUE(I67))","v":"Biškup Karlo-4"},null,"Biškup","Karlo","Biškup Karlo","karlo b","reversed username 4",4,2.79999999999999,2.33,"No"]
["Ne postoji JMBAG","Biškup Karlo-5",null,"Biškup","Karlo","Biškup Karlo","karlo b","reversed username 4",5,1.3,0,"No"]
["Ne postoji JMBAG","Biškup Karlo-6",null,"Biškup","Karlo","Biškup Karlo","karlo b","reversed username 4",6,1.6,0,"No"]
["Ne postoji JMBAG","Biškup Karlo-7",null,"Biškup","Karlo","Biškup Karlo","karlo b","reversed username 4",7,null,0.5,"No"]
["Ne postoji JMBAG","Biškup Karlo-8",null,"Biškup","Karlo","Biškup Karlo","karlo b","reversed username 4",8,null,1,"No"]
["7606001678-1","PostojiJMBAG","7606001678","Bobovec","Kristijan","Bobovec Kristijan","bobovec k","reversed username 2",1,3,1.5,"No"]
["7606001678-3","PostojiJMBAG","7606001678","Bobovec","Kristijan","Bobovec Kristijan","bobovec k","reversed username 2",3,3,2,"No"]
["7606001678-4","PostojiJMBAG","7606001678","Bobovec","Kristijan","Bobovec Kristijan","bobovec k","reversed username 2",4,3,3,"No"]
["7606001678-5","PostojiJMBAG","7606001678","Bobovec","Kristijan","Bobovec Kristijan","bobovec k","reversed username 2",5,2.3,1,"No"]
["7606001678-6","PostojiJMBAG","7606001678","Bobovec","Kristijan","Bobovec Kristijan","bobovec k","reversed username 2",6,3,1.5,"No"]
["7606001678-7","PostojiJMBAG","7606001678","Bobovec","Kristijan","Bobovec Kristijan","bobovec k","reversed username 2",7,2.5,1.5,"No"]
["7606001678-9","PostojiJMBAG","7606001678","Bobovec","Kristijan","Bobovec Kristijan","bobovec k","reversed username 2",9,3,0,"No"]
["0165055518-1","PostojiJMBAG","0165055518","Borbaš","Krešimir","Borbaš Krešimir","kborbas","direct",1,1.1,3,"No"]
["0165055518-3","PostojiJMBAG","0165055518","Borbaš","Krešimir","Borbaš Krešimir","borbask","reversed username 2",3,3,0.75,"No"]
["0165055518-4","PostojiJMBAG","0165055518","Borbaš","Krešimir","Borbaš Krešimir","borbask","reversed username 2",4,3,3,"No"]
["0165055518-5","PostojiJMBAG","0165055518","Borbaš","Krešimir","Borbaš Krešimir","borbask","reversed username 2",5,2.9,0.5,"Yes"]
["0165055518-6","PostojiJMBAG","0165055518","Borbaš","Krešimir","Borbaš Krešimir","borbask","reversed username 2",6,3,2.5,"Yes"]
["0165055518-7","PostojiJMBAG","0165055518","Borbaš","Krešimir","Borbaš Krešimir","borbask","reversed username 2",7,3,2.25,"No"]
["0165055518-8","PostojiJMBAG","0165055518","Borbaš","Krešimir","Borbaš Krešimir","borbask","reversed username 2",8,3,2.5,"Yes"]
["0165055518-9","PostojiJMBAG","0165055518","Borbaš","Krešimir","Borbaš Krešimir","borbask","reversed username 2",9,3,1.5,"No"]
["0321028528-6","PostojiJMBAG","0321028528","Borse","Bartol","Borse Bartol","bborse","direct",6,2.6,0,"No"]
["Ne postoji JMBAG","Boršić  Pia-1",null,"Boršić ","Pia","Boršić  Pia","pia borsic","reversed username 4",1,0.8,0,"No"]
["Ne postoji JMBAG","Boršić  Pia-4",null,"Boršić ","Pia","Boršić  Pia","pia","repeating characters in first name",4,1.7,1.5,"No"]
["Ne postoji JMBAG","Boršić  Pia-5",null,"Boršić ","Pia","Boršić  Pia","pia","repeating characters in first name",5,1.1,0,"No"]
["Ne postoji JMBAG","Boršić  Pia-7",null,"Boršić ","Pia","Boršić  Pia","pia","repeating characters in first name",7,null,0.5,"No"]
["7606001699-1","PostojiJMBAG","7606001699","Bošnjak","Leon Noa","Bošnjak Leon Noa","leon bosnjak","one first and last name",1,1.89999999999999,1.16666666666666,"No"]
["7606001699-3","PostojiJMBAG","7606001699","Bošnjak","Leon Noa","Bošnjak Leon Noa","leon bosnjak","one first and last name",3,2.5,1,"No"]
["7606001699-4","PostojiJMBAG","7606001699","Bošnjak","Leon Noa","Bošnjak Leon Noa","leon bosnjak","one first and last name",4,3,2.5,"No"]
["7606001699-6","PostojiJMBAG","7606001699","Bošnjak","Leon Noa","Bošnjak Leon Noa","leon bosnjak","one first and last name",6,3,2.5,"No"]
["7606001699-7","PostojiJMBAG","7606001699","Bošnjak","Leon Noa","Bošnjak Leon Noa","leon bosnjak","one first and last name",7,2.5,1.5,"Yes"]
["7606001699-9","PostojiJMBAG","7606001699","Bošnjak","Leon Noa","Bošnjak Leon Noa","leon bosnjak","one first and last name",9,2.5,1,"No"]
["0023148015-1","PostojiJMBAG","0023148015","Brdar","Toni","Brdar Toni","toni b","reversed username 4",1,null,2.5,"No"]
["0006040459-1","PostojiJMBAG","0006040459","Brigić","Bartol","Brigić Bartol","bartol b","reversed username 4",1,3,0.5,"No"]
["0006040459-3","PostojiJMBAG","0006040459","Brigić","Bartol","Brigić Bartol","bartol brigic","reversed username 4",3,2.6,1.5,"No"]
["0006040459-4","PostojiJMBAG","0006040459","Brigić","Bartol","Brigić Bartol","bartol b","reversed username 4",4,3,3,"Yes"]
["0117225804-1","PostojiJMBAG","0117225804","Briški","Josip","Briški Josip","josipb","reversed username 4",1,2.6,2,"No"]
["0117225804-4","PostojiJMBAG","0117225804","Briški","Josip","Briški Josip","josipb","reversed username 4",4,3,2.5,"Yes"]
["0117225804-5","PostojiJMBAG","0117225804","Briški","Josip","Briški Josip","jbriski","direct",5,3,0.5,"No"]
["0117225804-6","PostojiJMBAG","0117225804","Briški","Josip","Briški Josip","briskij","reversed username 2",6,3,1,"No"]
["0117225804-7","PostojiJMBAG","0117225804","Briški","Josip","Briški Josip","briskij","reversed username 2",7,2,0,"No"]
["7606002927-1","PostojiJMBAG","7606002927","Brletić","Ivan","Brletić Ivan","brletic i","reversed username 2",1,1.9,1.25,"No"]
["7606002927-3","PostojiJMBAG","7606002927","Brletić","Ivan","Brletić Ivan","i brletic","reversed username",3,3,0.5,"No"]
["7606002927-4","PostojiJMBAG","7606002927","Brletić","Ivan","Brletić Ivan","i brletic","reversed username",4,3,2.5,"No"]
["7606002927-5","PostojiJMBAG","7606002927","Brletić","Ivan","Brletić Ivan","i brletic","reversed username",5,1.5,0,"No"]
["7606002927-7","PostojiJMBAG","7606002927","Brletić","Ivan","Brletić Ivan","ibrletic","direct",7,3,1,"No"]
["7606002927-9","PostojiJMBAG","7606002927","Brletić","Ivan","Brletić Ivan","ivan brletic","one first and last name",9,1.5,0,"No"]
["7606000852-1","PostojiJMBAG","7606000852","Bubalo","Jure","Bubalo Jure","jure b","reversed username 4",1,1.5,2.25,"No"]
["7606000852-3","PostojiJMBAG","7606000852","Bubalo","Jure","Bubalo Jure","jure","repeating characters in first name",3,1.3,0.5,"No"]
["7606000852-7","PostojiJMBAG","7606000852","Bubalo","Jure","Bubalo Jure","jure","repeating characters in first name",7,0.4,1.5,"No"]
["7606000852-9","PostojiJMBAG","7606000852","Bubalo","Jure","Bubalo Jure","jure","repeating characters in first name",9,1,0,"No"]
["Ne postoji JMBAG","Bučko Andrej Vladimir-1",null,"Bučko","Andrej Vladimir","Bučko Andrej Vladimir","andrej vladimir","repeating characters in first name",1,1.9,1.5,"No"]
["Ne postoji JMBAG","Bučko Andrej Vladimir-3",null,"Bučko","Andrej Vladimir","Bučko Andrej Vladimir","andrej vladimir","repeating characters in first name",3,1.4,1.25,"No"]
["Ne postoji JMBAG","Bučko Andrej Vladimir-4",null,"Bučko","Andrej Vladimir","Bučko Andrej Vladimir","andrej vladimir","repeating characters in first name",4,3,3,"No"]
["Ne postoji JMBAG","Bučko Andrej Vladimir-5",null,"Bučko","Andrej Vladimir","Bučko Andrej Vladimir","andrej vladimir","repeating characters in first name",5,3,0.5,"No"]
{"$rows_left_out":728}
{"sheet":"HR","index":1,"n_rows":14,"n_cols":5,"rows_kept":14,"merged":[[3,0,13,0],[3,2,4,2],[3,3,3,4]]}
["U žuto polje upišite JMBAG.\nAko Vam JMBAG nije dodijeljen, upišite puno prezime i ime (kako je navedeno u InfoEduci)"]
[null,{"$f":"IFERROR(IFERROR(\"  \" & VLOOKUP($A$2,Points!C:L,4,FALSE),\"  \" & VLOOKUP($A$2,Points!F:L,1,FALSE)),\" Da biste vidjeli rezultate upišite ispravan JMBAG\")","v":" Da biste vidjeli rezultate upišite ispravan JMBAG"}]
[]
["Ova tablica je informativnog karaktera!\n\nAko ste pisali kviz za koji ne vidite bodove u tablici to znači da sustav nije prepoznao Vaše ime s kojim ste se prijavili u Kahoot kviz.\n\nU tablici su prikazani samo rezultati Kahoot kvizova i povezanih školskih zadaća.\n\nAko niste pisali Kahoot kviz za neki ishod onda Vam za taj ishod u tablici desno nisu vidljivi niti bodovi ostvareni na školskoj zadaći. \n\nSlužbeni bodovi dodijeljeni za rezultate ostvarene na školskim zadaćama su vidljivi u InfoEduci.\n\nU slučaju da veći broj kvizova pokriva isti ishod, u obzir se uzima srednja vrijednost ostvarenih bodova.",null,"Ishod","Bodovi"]
[{"$nulls":3},"Moodle","Kahoot"]
[null,null,1,{"$f":"IFERROR(IFERROR(VLOOKUP($A$2&\"-\"&$C6,Points!A:L,10,FALSE),VLOOKUP($A$2&\"-\"&$C6,Points!B:L,9,FALSE)),\"-\")","v":"-"},{"$f":"IFERROR(IFERROR(VLOOKUP($A$2&\"-\"&$C6,Points!A:L,11,FALSE),VLOOKUP($A$2&\"-\"&$C6,Points!B:L,10,FALSE)),\"-\")","v":"-"}]
[null,null,2,{"$f":"IFERROR(IFERROR(VLOOKUP($A$2&\"-\"&$C7,Points!A:L,10,FALSE),VLOOKUP($A$2&\"-\"&$C7,Points!B:L,9,FALSE)),\"-\")","v":"-"},{"$f":"IFERROR(IFERROR(VLOOKUP($A$2&\"-\"&$C7,Points!A:L,11,FALSE),VLOOKUP($A$2&\"-\"&$C7,Points!B:L,10,FALSE)),\"-\")","v":"-"}]
[null,null,3,{"$f":"IFERROR(IFERROR(VLOOKUP($A$2&\"-\"&$C8,Points!A:L,10,FALSE),VLOOKUP($A$2&\"-\"&$C8,Points!B:L,9,FALSE)),\"-\")","v":"-"},{"$f":"IFERROR(IFERROR(VLOOKUP($A$2&\"-\"&$C8,Points!A:L,11,FALSE),VLOOKUP($A$2&\"-\"&$C8,Points!B:L,10,FALSE)),\"-\")","v":"-"}]
[null,null,4,{"$f":"IFERROR(IFERROR(VLOOKUP($A$2&\"-\"&$C9,Points!A:L,10,FALSE),VLOOKUP($A$2&\"-\"&$C9,Points!B:L,9,FALSE)),\"-\")","v":"-"},{"$f":"IFERROR(IFERROR(VLOOKUP($A$2&\"-\"&$C9,Points!A:L,11,FALSE),VLOOKUP($A$2&\"-\"&$C9,Points!B:L,10,FALSE)),\"-\")","v":"-"}]
[null,null,5,{"$f":"IFERROR(IFERROR(VLOOKUP($A$2&\"-\"&$C10,Points!A:L,10,FALSE),VLOOKUP($A$2&\"-\"&$C10,Points!B:L,9,FALSE)),\"-\")","v":"-"},{"$f":"IFERROR(IFERROR(VLOOKUP($A$2&\"-\"&$C10,Points!A:L,11,FALSE),VLOOKUP($A$2&\"-\"&$C10,Points!B:L,10,FALSE)),\"-\")","v":"-"}]
[null,null,6,{"$f":"IFERROR(IFERROR(VLOOKUP($A$2&\"-\"&$C11,Points!A:L,10,FALSE),VLOOKUP($A$2&\"-\"&$C11,Points!B:L,9,FALSE)),\"-\")","v":"-"},{"$f":"IFERROR(IFERROR(VLOOKUP($A$2&\"-\"&$C11,Points!A:L,11,FALSE),VLOOKUP($A$2&\"-\"&$C11,Points!B:L,10,FALSE)),\"-\")","v":"-"}]
[null,null,7,{"$f":"IFERROR(IFERROR(VLOOKUP($A$2&\"-\"&$C12,Points!A:L,10,FALSE),VLOOKUP($A$2&\"-\"&$C12,Points!B:L,9,FALSE)),\"-\")","v":"-"},{"$f":"IFERROR(IFERROR(VLOOKUP($A$2&\"-\"&$C12,Points!A:L,11,FALSE),VLOOKUP($A$2&\"-\"&$C12,Points!B:L,10,FALSE)),\"-\")","v":"-"}]
[null,null,8,{"$f":"IFERROR(IFERROR(VLOOKUP($A$2&\"-\"&$C13,Points!A:L,10,FALSE),VLOOKUP($A$2&\"-\"&$C13,Points!B:L,9,FALSE)),\"-\")","v":"-"},{"$f":"IFERROR(IFERROR(VLOOKUP($A$2&\"-\"&$C13,Points!A:L,11,FALSE),VLOOKUP($A$2&\"-\"&$C13,Points!B:L,10,FALSE)),\"-\")","v":"-"}]
[null,null,9,{"$f":"IFERROR(IFERROR(VLOOKUP($A$2&\"-\"&$C14,Points!A:L,10,FALSE),VLOOKUP($A$2&\"-\"&$C14,Points!B:L,9,FALSE)),\"-\")","v":"-"},{"$f":"IFERROR(IFERROR(VLOOKUP($A$2&\"-\"&$C14,Points!A:L,11,FALSE),VLOOKUP($A$2&\"-\"&$C14,Points!B:L,10,FALSE)),\"-\")","v":"-"}]

{"sheet":"EN","index":2,"n_rows":14,"n_cols":5,"rows_kept":14,"hidden":true,"merged":[[3,0,13,0],[3,2,4,2],[3,3,3,4]]}
["Type JMBAG in the yellow field.\nIf JMBAG is not assigned to you, type a full surname and first name (as stated in the InfoEduka)"]
[null,{"$f":"IFERROR(IFERROR(\"  \" & VLOOKUP($A$2,Points!C:L,4,FALSE),\"  \" & VLOOKUP($A$2,Points!F:L,1,FALSE)),\" To view the results, enter a valid JMBAG.\")","v":" To view the results, enter a valid JMBAG."}]
[]
["This table is for informational purposes only!\n\nIf you completed a quiz but do not see your score in the table, it means the system did not recognize the name you used to log in to the Kahoot quiz.\n\nThe table displays only the results from Kahoot quizzes and related school assignments.\n\nIf you did not complete a Kahoot quiz for a specific learning outcome, the points earned on the corresponding school assignment will not be visible in the table.\n\nOfficial scores for school assignments are available in the InfoEduca system.\n\nIn cases where multiple quizzes cover the same learning outcome, the average score of all relevant quizzes is considered.",null,"Learning outcome","Points"]
[{"$nulls":3},"Moodle","Kahoot"]
[null,null,1,{"$f":"IFERROR(IFERROR(VLOOKUP($A$2&\"-\"&$C6,Points!A:L,10,FALSE),VLOOKUP($A$2&\"-\"&$C6,Points!B:L,9,FALSE)),\"-\")","v":"-"},{"$f":"IFERROR(IFERROR(VLOOKUP($A$2&\"-\"&$C6,Points!A:L,11,FALSE),VLOOKUP($A$2&\"-\"&$C6,Points!B:L,10,FALSE)),\"-\")","v":"-"}]
[null,null,2,{"$f":"IFERROR(IFERROR(VLOOKUP($A$2&\"-\"&$C7,Points!A:L,10,FALSE),VLOOKUP($A$2&\"-\"&$C7,Points!B:L,9,FALSE)),\"-\")","v":"-"},{"$f":"IFERROR(IFERROR(VLOOKUP($A$2&\"-\"&$C7,Points!A:L,11,FALSE),VLOOKUP($A$2&\"-\"&$C7,Points!B:L,10,FALSE)),\"-\")","v":"-"}]
[null,null,3,{"$f":"IFERROR(IFERROR(VLOOKUP($A$2&\"-\"&$C8,Points!A:L,10,FALSE),VLOOKUP($A$2&\"-\"&$C8,Points!B:L,9,FALSE)),\"-\")","v":"-"},{"$f":"IFERROR(IFERROR(VLOOKUP($A$2&\"-\"&$C8,Points!A:L,11,FALSE),VLOOKUP($A$2&\"-\"&$C8,Points!B:L,10,FALSE)),\"-\")","v":"-"}]
[null,null,4,{"$f":"IFERROR(IFERROR(VLOOKUP($A$2&\"-\"&$C9,Points!A:L,10,FALSE),VLOOKUP($A$2&\"-\"&$C9,Points!B:L,9,FALSE)),\"-\")","v":"-"},{"$f":"IFERROR(IFERROR(VLOOKUP($A$2&\"-\"&$C9,Points!A:L,11,FALSE),VLOOKUP($A$2&\"-\"&$C9,Points!B:L,10,FALSE)),\"-\")","v":"-"}]
[null,null,5,{"$f":"IFERROR(IFERROR(VLOOKUP($A$2&\"-\"&$C10,Points!A:L,10,FALSE),VLOOKUP($A$2&\"-\"&$C10,Points!B:L,9,FALSE)),\"-\")","v":"-"},{"$f":"IFERROR(IFERROR(VLOOKUP($A$2&\"-\"&$C10,Points!A:L,11,FALSE),VLOOKUP($A$2&\"-\"&$C10,Points!B:L,10,FALSE)),\"-\")","v":"-"}]
[null,null,6,{"$f":"IFERROR(IFERROR(VLOOKUP($A$2&\"-\"&$C11,Points!A:L,10,FALSE),VLOOKUP($A$2&\"-\"&$C11,Points!B:L,9,FALSE)),\"-\")","v":"-"},{"$f":"IFERROR(IFERROR(VLOOKUP($A$2&\"-\"&$C11,Points!A:L,11,FALSE),VLOOKUP($A$2&\"-\"&$C11,Points!B:L,10,FALSE)),\"-\")","v":"-"}]
[null,null,7,{"$f":"IFERROR(IFERROR(VLOOKUP($A$2&\"-\"&$C12,Points!A:L,10,FALSE),VLOOKUP($A$2&\"-\"&$C12,Points!B:L,9,FALSE)),\"-\")","v":"-"},{"$f":"IFERROR(IFERROR(VLOOKUP($A$2&\"-\"&$C12,Points!A:L,11,FALSE),VLOOKUP($A$2&\"-\"&$C12,Points!B:L,10,FALSE)),\"-\")","v":"-"}]
[null,null,8,{"$f":"IFERROR(IFERROR(VLOOKUP($A$2&\"-\"&$C13,Points!A:L,10,FALSE),VLOOKUP($A$2&\"-\"&$C13,Points!B:L,9,FALSE)),\"-\")","v":"-"},{"$f":"IFERROR(IFERROR(VLOOKUP($A$2&\"-\"&$C13,Points!A:L,11,FALSE),VLOOKUP($A$2&\"-\"&$C13,Points!B:L,10,FALSE)),\"-\")","v":"-"}]
[null,null,9,{"$f":"IFERROR(IFERROR(VLOOKUP($A$2&\"-\"&$C14,Points!A:L,10,FALSE),VLOOKUP($A$2&\"-\"&$C14,Points!B:L,9,FALSE)),\"-\")","v":"-"},{"$f":"IFERROR(IFERROR(VLOOKUP($A$2&\"-\"&$C14,Points!A:L,11,FALSE),VLOOKUP($A$2&\"-\"&$C14,Points!B:L,10,FALSE)),\"-\")","v":"-"}]